Reaction Details
TargetOxytocin receptor
LigandBDBM50313814
Substrate/Competitorn/a
Meas. Tech.ChEMBL_615224 (CHEMBL1115874)
Ki 48.4±n/a nM
Citation Brown, AEllis, DWallace, ORalph, M Identification of a urea bioisostere of a triazole oxytocin antagonist. Bioorg Med Chem Lett20:1851-3 (2010) 
 
Oxytocin receptor
Name:Oxytocin receptor
Type:Enzyme Catalytic Domain
Mol. Mass.:42793.26
Organism:Homo sapiens (Human)
Description:Oxytocin OXTR HEK293::B2R9L7
Residue:389
BDBM50313814
NameBDBM50313814
Synonyms:3-(2-chloro-4-fluorophenoxy)-N-ethyl-N-(6-methoxypyridin-3-yl)azetidine-1-carboxamide | CHEMBL1094049
TypeSmall organic molecule
Emp. Form.C18H19ClFN3O3
Mol. Mass.379.813
SMILESCCN(C(=O)N1CC(C1)Oc1ccc(F)cc1Cl)c1ccc(OC)nc1