Reaction Details
TargetBeta-secretase 1
LigandBDBM50313901
Substrate/Competitorn/a
Meas. Tech.ChEMBL_615459 (CHEMBL1107777)
pH7.2±n/a
IC50 432±n/a nM
Commentsextracted
Citation Rajapakse, HANantermet, PGSelnick, HGBarrow, JCMcGaughey, GBMunshi, SLindsley, SRYoung, MBNgo, PLHolloway, MKLai, MTEspeseth, ASShi, XPColussi, DPietrak, BCrouthamel, MCTugusheva, KHuang, QXu, MSimon, AJKuo, LHazuda, DJGraham, SVacca, JP SAR of tertiary carbinamine derived BACE1 inhibitors: role of aspartate ligand amine pKa in enzyme inhibition. Bioorg Med Chem Lett20:1885-9 (2010) 
 
Beta-secretase 1
Name:Beta-secretase 1
Type:Protein
Mol. Mass.:55755.10
Organism:Homo sapiens (Human)
Description:P56817
Residue:501
BDBM50313901
NameBDBM50313901
Synonyms:3-((2-amino-2-benzyl-3-fluoropropoxy)methyl)-N-((R)-1-(4-fluorophenyl)ethyl)-5-(N-methylmethylsulfonamido)benzamide | CHEMBL1093394
TypeSmall organic molecule
Emp. Form.C28H33F2N3O4S
Mol. Mass.545.641
SMILESC[C@@H](NC(=O)c1cc(COCC(N)(CF)Cc2ccccc2)cc(c1)N(C)S(C)(=O)=O)c1ccc(F)cc1