Reaction Details
TargetBeta-secretase 1
LigandBDBM50313889
Substrate/Competitorn/a
Meas. Tech.ChEMBL_615459 (CHEMBL1107777)
pH7.2±n/a
IC50 580±n/a nM
Commentsextracted
Citation Rajapakse, HANantermet, PGSelnick, HGBarrow, JCMcGaughey, GBMunshi, SLindsley, SRYoung, MBNgo, PLHolloway, MKLai, MTEspeseth, ASShi, XPColussi, DPietrak, BCrouthamel, MCTugusheva, KHuang, QXu, MSimon, AJKuo, LHazuda, DJGraham, SVacca, JP SAR of tertiary carbinamine derived BACE1 inhibitors: role of aspartate ligand amine pKa in enzyme inhibition. Bioorg Med Chem Lett20:1885-9 (2010) 
 
Beta-secretase 1
Name:Beta-secretase 1
Type:Protein
Mol. Mass.:55755.10
Organism:Homo sapiens (Human)
Description:P56817
Residue:501
BDBM50313889
NameBDBM50313889
Synonyms:3-(((R)-2-amino-2-benzyl-3-hydroxypropoxy)methyl)-N-((R)-1-(4-fluorophenyl)ethyl)-5-(N-methylmethylsulfonamido)benzamide | CHEMBL1086788
TypeSmall organic molecule
Emp. Form.C28H34FN3O5S
Mol. Mass.543.65
SMILESC[C@@H](NC(=O)c1cc(COC[C@](N)(CO)Cc2ccccc2)cc(c1)N(C)S(C)(=O)=O)c1ccc(F)cc1