Reaction Details
TargetSerine/threonine-protein kinase NLK
LigandBDBM50314070
Substrate/Competitorn/a
Meas. Tech.ChEMBL_627168 (CHEMBL1111810)
Kd 170±n/a nM
Citation Goldstein, DMKuglstatter, ALou, YSoth, MJ Selective p38alpha inhibitors clinically evaluated for the treatment of chronic inflammatory disorders. J Med Chem53:2345-53 (2010) 
 
Serine/threonine-protein kinase NLK
Name:Serine/threonine-protein kinase NLK
Type:PROTEIN
Mol. Mass.:58306.88
Organism:Homo sapiens (Human)
Description:ChEMBL_774580
Residue:527
BDBM50314070
NameBDBM50314070
Synonyms:6-(2,4-difluorophenoxy)-2-{[3-hydroxy-1-(2-hydroxyethyl)propyl]amino}-8-methylpyrido[2,3-d]pyrimidin-7(8H)-one pamapimod
TypeSmall organic molecule
Emp. Form.C19H20F2N4O4
Mol. Mass.406.3833
SMILESCn1c2nc(NC(CCO)CCO)ncc2cc(Oc2ccc(F)cc2F)c1=O