Reaction Details
TargetPhosphatidylinositol 4-kinase beta
LigandBDBM50314071
Substrate/Competitorn/a
Meas. Tech.ChEMBL_627169 (CHEMBL1111811)
Kd 3300±n/a nM
Citation Goldstein, DMKuglstatter, ALou, YSoth, MJ Selective p38alpha inhibitors clinically evaluated for the treatment of chronic inflammatory disorders. J Med Chem53:2345-53 (2010) 
 
Phosphatidylinositol 4-kinase beta
Name:Phosphatidylinositol 4-kinase beta
Type:Protein
Mol. Mass.:91373.30
Organism:Homo sapiens (Human)
Description:n/a
Residue:816
BDBM50314071
NameBDBM50314071
Synonyms:2-(2,4-difluorophenyl)-6-(1-(2,6-difluorophenyl)ureido)nicotinamide VX-702
TypeSmall organic molecule
Emp. Form.C19H12F4N4O2
Mol. Mass.404.3178
SMILESNC(=O)N(c1ccc(C(N)=O)c(n1)-c1ccc(F)cc1F)c1c(F)cccc1F