Reaction Details
TargetMitogen-activated protein kinase 10
LigandBDBM50314147
Substrate/Competitorn/a
Meas. Tech.ChEMBL_624060 (CHEMBL1116946)
Ki 5±n/a nM
Citation Siddiqui, MAReddy, PA Small molecule JNK (c-Jun N-terminal kinase) inhibitors. J Med Chem53:3005-12 (2010) 
 
Mitogen-activated protein kinase 10
Name:Mitogen-activated protein kinase 10
Type:Enzyme
Mol. Mass.:52586.89
Organism:Homo sapiens (Human)
Description:n/a
Residue:464
BDBM50314147
NameBDBM50314147
Synonyms:CHEMBL1094014 | trans-4-(4-(1-benzyl-5-(dimethylamino)-1H-pyrazol-4-yl)pyrimidin-2-ylamino)cyclohexanol
TypeSmall organic molecule
Emp. Form.C22H28N6O
Mol. Mass.392.4973
SMILESCN(C)c1c(cnn1Cc1ccccc1)-c1ccnc(N[C@H]2CC[C@H](O)CC2)n1