Reaction Details
TargetSerine/threonine-protein kinase mTOR
LigandBDBM50314342
Substrate/Competitorn/a
Meas. Tech.ChEMBL_624363 (CHEMBL1107893)
IC50 8.2±n/a nM
Citation Tsou, HRMacEwan, GBirnberg, GZhang, NBrooijmans, NToral-Barza, LHollander, IAyral-Kaloustian, SYu, K 4-Substituted-7-azaindoles bearing a ureidobenzofuranone moiety as potent and selective, ATP-competitive inhibitors of the mammalian target of rapamycin (mTOR). Bioorg Med Chem Lett20:2259-63 (2010) 
 
Serine/threonine-protein kinase mTOR
Name:Serine/threonine-protein kinase mTOR
Type:Rapamycin target protein
Mol. Mass.:288917.12
Organism:Homo sapiens (Human)
Description:P42345
Residue:2549
BDBM50314342
NameBDBM50314342
Synonyms:(Z)-1-(2-((1-methyl-4-(4-(pyrrolidine-1-carbonyl)piperidin-1-yl)-1H-pyrrolo[2,3-b]pyridin-3-yl)methylene)-3-oxo-2,3-dihydrobenzofuran-5-yl)-3-(pyridin-3-yl)urea | CHEMBL1091699
TypeSmall organic molecule
Emp. Form.C33H33N7O4
Mol. Mass.591.6596
SMILESCn1cc(\C=C2/Oc3ccc(NC(=O)Nc4cccnc4)cc3C2=O)c2c(ccnc12)N1CCC(CC1)C(=O)N1CCCC1