Reaction Details
TargetSerine/threonine-protein kinase mTOR
LigandBDBM50314350
Substrate/Competitorn/a
Meas. Tech.ChEMBL_624367 (CHEMBL1107897)
IC50 0.380000±n/a nM
Citation Tsou, HRMacEwan, GBirnberg, GGrosu, GBursavich, MGBard, JBrooijmans, NToral-Barza, LHollander, IMansour, TSAyral-Kaloustian, SYu, K Discovery and optimization of 2-(4-substituted-pyrrolo[2,3-b]pyridin-3-yl)methylene-4-hydroxybenzofuran-3(2H)-ones as potent and selective ATP-competitive inhibitors of the mammalian target of rapamycin (mTOR). Bioorg Med Chem Lett20:2321-5 (2010) 
 
Serine/threonine-protein kinase mTOR
Name:Serine/threonine-protein kinase mTOR
Type:Rapamycin target protein
Mol. Mass.:288917.12
Organism:Homo sapiens (Human)
Description:P42345
Residue:2549
BDBM50314350
NameBDBM50314350
Synonyms:2-((4-(8-oxa-3-azabicyclo[3.2.1]octan-3-yl)-1-methyl-1H-pyrrolo[2,3-b]pyridin-3-yl)methylene)-4-hydroxybenzofuran-3(2H)-one | CHEMBL1090381
TypeSmall organic molecule
Emp. Form.C23H21N3O4
Mol. Mass.403.4305
SMILESCn1cc(\C=C2/Oc3cccc(O)c3C2=O)c2c(ccnc12)N1CC2CCC(C1)O2