Reaction Details
TargetOxytocin receptor
LigandBDBM50314502
Substrate/Competitorn/a
Meas. Tech.ChEMBL_624611 (CHEMBL1111571)
Ki 90±n/a nM
Citation Brown, AEllis, DWallace, ORalph, M Identification of amide bioisosteres of triazole oxytocin antagonists. Bioorg Med Chem Lett20:2224-8 (2010) 
 
Oxytocin receptor
Name:Oxytocin receptor
Type:Enzyme Catalytic Domain
Mol. Mass.:42793.26
Organism:Homo sapiens (Human)
Description:Oxytocin OXTR HEK293::B2R9L7
Residue:389
BDBM50314502
NameBDBM50314502
Synonyms:CHEMBL1092098 | N-(6-methoxypyridin-3-yl)-N-methylbiphenyl-4-carboxamide
TypeSmall organic molecule
Emp. Form.C20H18N2O2
Mol. Mass.318.3691
SMILESCOc1ccc(cn1)N(C)C(=O)c1ccc(cc1)-c1ccccc1