Reaction Details
TargetcAMP-specific 3',5'-cyclic phosphodiesterase 4B
LigandBDBM50314561
Substrate/Competitorn/a
Meas. Tech.ChEMBL_625097 (CHEMBL1112546)
Ki 2010±n/a nM
Citation Donnell, AFDollings, PJButera, JADietrich, AJLipinski, KKGhavami, AHirst, WD Identification of pyridazino[4,5-b]indolizines as selective PDE4B inhibitors. Bioorg Med Chem Lett20:2163-7 (2010) 
 
cAMP-specific 3',5'-cyclic phosphodiesterase 4B
Name:cAMP-specific 3',5'-cyclic phosphodiesterase 4B
Type:Protein
Mol. Mass.:83318.87
Organism:Homo sapiens (Human)
Description:Q07343
Residue:736
BDBM50314561
NameBDBM50314561
Synonyms:4-(3-chlorophenyl)-N-(3-(4-(pyrimidin-2-yl)piperazin-1-yl)propyl)pyridazino[4,5-b]indolizin-1-amine | CHEMBL1092165
TypeSmall organic molecule
Emp. Form.C27H27ClN8
Mol. Mass.499.01
SMILESClc1cccc(c1)-c1nnc(NCCCN2CCN(CC2)c2ncccn2)c2cc3ccccn3c12