Reaction Details
TargetcAMP-specific 3',5'-cyclic phosphodiesterase 4B
LigandBDBM50314571
Substrate/Competitorn/a
Meas. Tech.ChEMBL_625097 (CHEMBL1112546)
Ki 241±n/a nM
Citation Donnell, AFDollings, PJButera, JADietrich, AJLipinski, KKGhavami, AHirst, WD Identification of pyridazino[4,5-b]indolizines as selective PDE4B inhibitors. Bioorg Med Chem Lett20:2163-7 (2010) 
 
cAMP-specific 3',5'-cyclic phosphodiesterase 4B
Name:cAMP-specific 3',5'-cyclic phosphodiesterase 4B
Type:Protein
Mol. Mass.:83318.87
Organism:Homo sapiens (Human)
Description:Q07343
Residue:736
BDBM50314571
NameBDBM50314571
Synonyms:(4-(3-(4-(3-fluorophenyl)pyridazino[4,5-b]indolizin-1-ylamino)propyl)piperazin-1-yl)(pyridin-2-yl)methanone | CHEMBL1093070
TypeSmall organic molecule
Emp. Form.C29H28FN7O
Mol. Mass.509.5773
SMILESFc1cccc(c1)-c1nnc(NCCCN2CCN(CC2)C(=O)c2ccccn2)c2cc3ccccn3c12