Reaction Details
TargetcAMP-specific 3',5'-cyclic phosphodiesterase 4B
LigandBDBM50314573
Substrate/Competitorn/a
Meas. Tech.ChEMBL_625097 (CHEMBL1112546)
Ki 5500±n/a nM
Citation Donnell, AFDollings, PJButera, JADietrich, AJLipinski, KKGhavami, AHirst, WD Identification of pyridazino[4,5-b]indolizines as selective PDE4B inhibitors. Bioorg Med Chem Lett20:2163-7 (2010) 
 
cAMP-specific 3',5'-cyclic phosphodiesterase 4B
Name:cAMP-specific 3',5'-cyclic phosphodiesterase 4B
Type:Protein
Mol. Mass.:83318.87
Organism:Homo sapiens (Human)
Description:Q07343
Residue:736
BDBM50314573
NameBDBM50314573
Synonyms:(4-(3-(7-(3-chlorophenyl)-1,2-dimethyl-1H-pyrrolo[3,2-d]pyridazin-4-ylamino)propyl)piperazin-1-yl)(pyrimidin-2-yl)methanone | CHEMBL1093094
TypeSmall organic molecule
Emp. Form.C26H29ClN8O
Mol. Mass.505.014
SMILESCc1cc2c(NCCCN3CCN(CC3)C(=O)c3ncccn3)nnc(-c3cccc(Cl)c3)c2n1C