Reaction Details
TargetcAMP-specific 3',5'-cyclic phosphodiesterase 4B
LigandBDBM50314576
Substrate/Competitorn/a
Meas. Tech.ChEMBL_625097 (CHEMBL1112546)
Ki 52200±n/a nM
Citation Donnell, AFDollings, PJButera, JADietrich, AJLipinski, KKGhavami, AHirst, WD Identification of pyridazino[4,5-b]indolizines as selective PDE4B inhibitors. Bioorg Med Chem Lett20:2163-7 (2010) 
 
cAMP-specific 3',5'-cyclic phosphodiesterase 4B
Name:cAMP-specific 3',5'-cyclic phosphodiesterase 4B
Type:Protein
Mol. Mass.:83318.87
Organism:Homo sapiens (Human)
Description:Q07343
Residue:736
BDBM50314576
NameBDBM50314576
Synonyms:(4-(3-(1,2-dimethyl-7-(3-nitrophenyl)-1H-pyrrolo[3,2-d]pyridazin-4-ylamino)propyl)piperazin-1-yl)(pyridin-4-yl)methanone | CHEMBL1090703
TypeSmall organic molecule
Emp. Form.C27H30N8O3
Mol. Mass.514.5789
SMILESCc1cc2c(NCCCN3CCN(CC3)C(=O)c3ccncc3)nnc(-c3cccc(c3)[N+]([O-])=O)c2n1C