Reaction Details
Target5-hydroxytryptamine receptor 2A
LigandBDBM50314613
Substrate/Competitorn/a
Meas. Tech.ChEMBL_625298 (CHEMBL1109736)
Ki 12.8±n/a nM
Citation Liu, KKLefker, BADombroski, MAChiang, PCornelius, PPatterson, TAZeng, YSantucci, STomlinson, EGibbons, CPMarala, RBrown, JAKong, JXLee, EWerner, WWenzel, ZGiragossian, CChen, HCoffey, SB Orally active and brain permeable proline amides as highly selective 5HT2c agonists for the treatment of obesity. Bioorg Med Chem Lett20:2365-9 (2010) 
 
5-hydroxytryptamine receptor 2A
Name:5-hydroxytryptamine receptor 2A
Type:undefined
Mol. Mass.:52607.65
Organism:Homo sapiens (Human)
Description:P28223
Residue:471
BDBM50314613
NameBDBM50314613
Synonyms:(S)-N-(4-(4,4-dimethylcyclohexyloxy)-5-fluoro-2-methoxybenzyl)pyrrolidine-2-carboxamide | CHEMBL1091105
TypeSmall organic molecule
Emp. Form.C21H31FN2O3
Mol. Mass.378.4808
SMILESCOc1cc(OC2CCC(C)(C)CC2)c(F)cc1CNC(=O)[C@@H]1CCCN1