Reaction Details
Target5-hydroxytryptamine receptor 2A
LigandBDBM50314616
Substrate/Competitorn/a
Meas. Tech.ChEMBL_625301 (CHEMBL1109739)
EC50 500±n/a nM
Citation Liu, KKLefker, BADombroski, MAChiang, PCornelius, PPatterson, TAZeng, YSantucci, STomlinson, EGibbons, CPMarala, RBrown, JAKong, JXLee, EWerner, WWenzel, ZGiragossian, CChen, HCoffey, SB Orally active and brain permeable proline amides as highly selective 5HT2c agonists for the treatment of obesity. Bioorg Med Chem Lett20:2365-9 (2010) 
 
5-hydroxytryptamine receptor 2A
Name:5-hydroxytryptamine receptor 2A
Type:undefined
Mol. Mass.:52607.65
Organism:Homo sapiens (Human)
Description:P28223
Residue:471
BDBM50314616
NameBDBM50314616
Synonyms:(S)-N-(4-(cyclohexylmethoxy)-5-fluoro-2-methoxybenzyl)pyrrolidine-2-carboxamide | CHEMBL1093699
TypeSmall organic molecule
Emp. Form.C20H29FN2O3
Mol. Mass.364.4543
SMILESCOc1cc(OCC2CCCCC2)c(F)cc1CNC(=O)[C@@H]1CCCN1