Reaction Details
Target5-hydroxytryptamine receptor 2B
LigandBDBM50314625
Substrate/Competitorn/a
Meas. Tech.ChEMBL_625152 (CHEMBL1115173)
Ki 2400±n/a nM
Citation Liu, KKLefker, BADombroski, MAChiang, PCornelius, PPatterson, TAZeng, YSantucci, STomlinson, EGibbons, CPMarala, RBrown, JAKong, JXLee, EWerner, WWenzel, ZGiragossian, CChen, HCoffey, SB Orally active and brain permeable proline amides as highly selective 5HT2c agonists for the treatment of obesity. Bioorg Med Chem Lett20:2365-9 (2010) 
 
5-hydroxytryptamine receptor 2B
Name:5-hydroxytryptamine receptor 2B
Type:G Protein-Coupled Receptor (GPCR)
Mol. Mass.:54312.47
Organism:Homo sapiens (Human)
Description:Receptor binding assays were performed using human clone stably expressed in CHO cells.
Residue:481
BDBM50314625
NameBDBM50314625
Synonyms:(S)-N-(4-(3-fluorophenoxy)benzyl)pyrrolidine-2-carboxamide | CHEMBL1090757
TypeSmall organic molecule
Emp. Form.C18H19FN2O2
Mol. Mass.314.3541
SMILESFc1cccc(Oc2ccc(CNC(=O)[C@@H]3CCCN3)cc2)c1