Reaction Details
TargetCyclin-dependent kinase/G2/mitotic-specific cyclin- 1
LigandBDBM50315069
Substrate/Competitorn/a
Meas. Tech.ChEMBL_624639 (CHEMBL1111599)
IC50<50000±n/a nM
Citation Verheijen, JCRichard, DJCurran, KKaplan, JYu, KZask, A 2-Arylureidophenyl-4-(3-oxa-8-azabicyclo[3.2.1]octan-8-yl)triazines as highly potent and selective ATP competitive mTOR inhibitors: optimization of human microsomal stability. Bioorg Med Chem Lett20:2648-53 (2010) 
 
Cyclin-dependent kinase/G2/mitotic-specific cyclin- 1
Name:Cyclin-dependent kinase/G2/mitotic-specific cyclin- 1
Type:Protein Complex
Mol. Mass.:n/a
Description:CDK1/Cyclin B complexes were purified from insect cells co-infected with baculovirus vectors containing each of the components.
Components:This complex has 2 components.
Component 1
Name:Cyclin-dependent kinase 1
Synonyms:CDC2 CDK1 CDKN1 Cell division protein kinase 1 P34CDC2 | p34 protein kinase
Type:Enzyme Subunit
Mol. Mass.:34101.08
Organism:Homo sapiens (Human)
Description:P06493
Residue:297
Component 2
Name:G2/mitotic-specific cyclin-B1
Synonyms:CCNB CCNB1_HUMAN
Type:Enzyme Subunit
Mol. Mass.:48340.95
Organism:Homo sapiens (Human)
Description:P14635
Residue:433
BDBM50315069
NameBDBM50315069
Synonyms:1-(4-(4-(3-oxa-8-azabicyclo[3.2.1]octan-8-yl)-6-(tetrahydro-2H-pyran-4-yl)-1,3,5-triazin-2-yl)phenyl)-3-(4-(4-isopropylpiperazine-1-carbonyl)phenyl)urea | CHEMBL1091356
TypeSmall organic molecule
Emp. Form.C35H44N8O4
Mol. Mass.640.7751
SMILESCC(C)N1CCN(CC1)C(=O)c1ccc(NC(=O)Nc2ccc(cc2)-c2nc(nc(n2)N2C3CCC2COC3)C2CCOCC2)cc1