Reaction Details
TargetSerine/threonine-protein kinase mTOR
LigandBDBM50315056
Substrate/Competitorn/a
Meas. Tech.ChEMBL_624459 (CHEMBL1108787)
IC50 0.18±n/a nM
Citation Verheijen, JCRichard, DJCurran, KKaplan, JYu, KZask, A 2-Arylureidophenyl-4-(3-oxa-8-azabicyclo[3.2.1]octan-8-yl)triazines as highly potent and selective ATP competitive mTOR inhibitors: optimization of human microsomal stability. Bioorg Med Chem Lett20:2648-53 (2010) 
 
Serine/threonine-protein kinase mTOR
Name:Serine/threonine-protein kinase mTOR
Type:Rapamycin target protein
Mol. Mass.:288917.12
Organism:Homo sapiens (Human)
Description:P42345
Residue:2549
BDBM50315056
NameBDBM50315056
Synonyms:1-(4-(4,6-di(3-oxa-8-azabicyclo[3.2.1]octan-8-yl)-1,3,5-triazin-2-yl)phenyl)-3-(4-(hydroxymethyl)phenyl)urea | CHEMBL1091596
TypeSmall organic molecule
Emp. Form.C29H33N7O4
Mol. Mass.543.6168
SMILESOCc1ccc(NC(=O)Nc2ccc(cc2)-c2nc(nc(n2)N2C3CCC2COC3)N2C3CCC2COC3)cc1