Reaction Details
TargetSerine/threonine-protein kinase mTOR
LigandBDBM50315072
Substrate/Competitorn/a
Meas. Tech.ChEMBL_624459 (CHEMBL1108787)
IC50 0.70±n/a nM
Citation Verheijen, JCRichard, DJCurran, KKaplan, JYu, KZask, A 2-Arylureidophenyl-4-(3-oxa-8-azabicyclo[3.2.1]octan-8-yl)triazines as highly potent and selective ATP competitive mTOR inhibitors: optimization of human microsomal stability. Bioorg Med Chem Lett20:2648-53 (2010) 
 
Serine/threonine-protein kinase mTOR
Name:Serine/threonine-protein kinase mTOR
Type:Rapamycin target protein
Mol. Mass.:288917.12
Organism:Homo sapiens (Human)
Description:P42345
Residue:2549
BDBM50315072
NameBDBM50315072
Synonyms:1-(4-(4-(3-oxa-8-azabicyclo[3.2.1]octan-8-yl)-6-(tetrahydro-2H-pyran-4-yl)-1,3,5-triazin-2-yl)phenyl)-3-(4-(2-(dimethylamino)ethoxy)phenyl)urea | CHEMBL1091359
TypeSmall organic molecule
Emp. Form.C31H39N7O4
Mol. Mass.573.6859
SMILESCN(C)CCOc1ccc(NC(=O)Nc2ccc(cc2)-c2nc(nc(n2)N2C3CCC2COC3)C2CCOCC2)cc1