Reaction Details
TargetPhosphatidylinositol 4,5-bisphosphate 3-kinase catalytic subunit alpha isoform
LigandBDBM50315070
Substrate/Competitorn/a
Meas. Tech.ChEMBL_624460 (CHEMBL1108788)
IC50 77±n/a nM
Citation Verheijen, JCRichard, DJCurran, KKaplan, JYu, KZask, A 2-Arylureidophenyl-4-(3-oxa-8-azabicyclo[3.2.1]octan-8-yl)triazines as highly potent and selective ATP competitive mTOR inhibitors: optimization of human microsomal stability. Bioorg Med Chem Lett20:2648-53 (2010) 
 
Phosphatidylinositol 4,5-bisphosphate 3-kinase catalytic subunit alpha isoform
Name:Phosphatidylinositol 4,5-bisphosphate 3-kinase catalytic subunit alpha isoform
Type:Enzyme Subunit
Mol. Mass.:124294.87
Organism:Homo sapiens (Human)
Description:P42336
Residue:1068
BDBM50315070
NameBDBM50315070
Synonyms:1-(4-(4-(3-oxa-8-azabicyclo[3.2.1]octan-8-yl)-6-(tetrahydro-2H-pyran-4-yl)-1,3,5-triazin-2-yl)phenyl)-3-(4-(4-(dimethylamino)piperidine-1-carbonyl)phenyl)urea | CHEMBL1091357
TypeSmall organic molecule
Emp. Form.C35H44N8O4
Mol. Mass.640.7751
SMILESCN(C)C1CCN(CC1)C(=O)c1ccc(NC(=O)Nc2ccc(cc2)-c2nc(nc(n2)N2C3CCC2COC3)C2CCOCC2)cc1