Reaction Details
TargetPhosphatidylinositol 4,5-bisphosphate 3-kinase catalytic subunit alpha isoform
LigandBDBM50315082
Substrate/Competitorn/a
Meas. Tech.ChEMBL_624710 (CHEMBL1112502)
IC50 90±n/a nM
Citation Richard, DJVerheijen, JCYu, KZask, A Triazines incorporating (R)-3-methylmorpholine are potent inhibitors of the mammalian target of rapamycin (mTOR) with selectivity over PI3Kalpha. Bioorg Med Chem Lett20:2654-7 (2010) 
 
Phosphatidylinositol 4,5-bisphosphate 3-kinase catalytic subunit alpha isoform
Name:Phosphatidylinositol 4,5-bisphosphate 3-kinase catalytic subunit alpha isoform
Type:Enzyme Subunit
Mol. Mass.:124294.87
Organism:Homo sapiens (Human)
Description:P42336
Residue:1068
BDBM50315082
NameBDBM50315082
Synonyms:(R)-1-(4-(4-isopropylpiperazine-1-carbonyl)phenyl)-3-(4-(4-(3-methylmorpholino)-6-(tetrahydro-2H-pyran-4-yl)-1,3,5-triazin-2-yl)phenyl)urea | CHEMBL1092046
TypeSmall organic molecule
Emp. Form.C34H44N8O4
Mol. Mass.628.7644
SMILESCC(C)N1CCN(CC1)C(=O)c1ccc(NC(=O)Nc2ccc(cc2)-c2nc(nc(n2)N2CCOC[C@H]2C)C2CCOCC2)cc1