Reaction Details
TargetSerine/threonine-protein kinase mTOR
LigandBDBM50315093
Substrate/Competitorn/a
Meas. Tech.ChEMBL_624711 (CHEMBL1112503)
IC50 1±n/a nM
Citation Richard, DJVerheijen, JCYu, KZask, A Triazines incorporating (R)-3-methylmorpholine are potent inhibitors of the mammalian target of rapamycin (mTOR) with selectivity over PI3Kalpha. Bioorg Med Chem Lett20:2654-7 (2010) 
 
Serine/threonine-protein kinase mTOR
Name:Serine/threonine-protein kinase mTOR
Type:PROTEIN
Mol. Mass.:288819.88
Organism:Rattus norvegicus
Description:ChEMBL_1460639
Residue:2549
BDBM50315093
NameBDBM50315093
Synonyms:(R)-1-(4-(4-(3-methylmorpholino)-6-(tetrahydro-2H-pyran-4-yl)-1,3,5-triazin-2-yl)phenyl)-3-(4-(4-methylpiperazine-1-carbonyl)phenyl)urea | CHEMBL1092045
TypeSmall organic molecule
Emp. Form.C32H40N8O4
Mol. Mass.600.7112
SMILESC[C@@H]1COCCN1c1nc(nc(n1)-c1ccc(NC(=O)Nc2ccc(cc2)C(=O)N2CCN(C)CC2)cc1)C1CCOCC1