Reaction Details
TargetMelatonin receptor type 1B
LigandBDBM50315178
Substrate/Competitorn/a
Meas. Tech.ChEMBL_624960 (CHEMBL1107083)
Ki 0.00103±n/a nM
Citation Hu, YHo, MKChan, KHNew, DCWong, YH Synthesis of substituted N-[3-(3-methoxyphenyl)propyl] amides as highly potent MT(2)-selective melatonin ligands. Bioorg Med Chem Lett20:2582-5 (2010) 
 
Melatonin receptor type 1B
Name:Melatonin receptor type 1B
Type:Enzyme
Mol. Mass.:40203.54
Organism:Homo sapiens (Human)
Description:P49286
Residue:362
BDBM50315178
NameBDBM50315178
Synonyms:CHEMBL1088825 | N-(3-(2-(benzyloxy)-5-methoxyphenyl)propyl)butyramide
TypeSmall organic molecule
Emp. Form.C21H27NO3
Mol. Mass.341.444
SMILESCCCC(=O)NCCCc1cc(OC)ccc1OCc1ccccc1