Reaction Details
TargetMelatonin receptor type 1B
LigandBDBM50315165
Substrate/Competitorn/a
Meas. Tech.ChEMBL_624960 (CHEMBL1107083)
Ki 26.1±n/a nM
Citation Hu, YHo, MKChan, KHNew, DCWong, YH Synthesis of substituted N-[3-(3-methoxyphenyl)propyl] amides as highly potent MT(2)-selective melatonin ligands. Bioorg Med Chem Lett20:2582-5 (2010) 
 
Melatonin receptor type 1B
Name:Melatonin receptor type 1B
Type:Enzyme
Mol. Mass.:40203.54
Organism:Homo sapiens (Human)
Description:P49286
Residue:362
BDBM50315165
NameBDBM50315165
Synonyms:CHEMBL1092400 | N-(3-(2,5-dimethoxyphenyl)propyl)acetamide
TypeSmall organic molecule
Emp. Form.C13H19NO3
Mol. Mass.237.2949
SMILESCOc1ccc(OC)c(CCCNC(C)=O)c1