Reaction Details
TargetMelatonin receptor type 1B
LigandBDBM50315166
Substrate/Competitorn/a
Meas. Tech.ChEMBL_624960 (CHEMBL1107083)
Ki 1.59±n/a nM
Citation Hu, YHo, MKChan, KHNew, DCWong, YH Synthesis of substituted N-[3-(3-methoxyphenyl)propyl] amides as highly potent MT(2)-selective melatonin ligands. Bioorg Med Chem Lett20:2582-5 (2010) 
 
Melatonin receptor type 1B
Name:Melatonin receptor type 1B
Type:Enzyme
Mol. Mass.:40203.54
Organism:Homo sapiens (Human)
Description:P49286
Residue:362
BDBM50315166
NameBDBM50315166
Synonyms:CHEMBL1091561 | N-(3-(2-ethoxy-5-methoxyphenyl)propyl)acetamide
TypeSmall organic molecule
Emp. Form.C14H21NO3
Mol. Mass.251.3214
SMILESCCOc1ccc(OC)cc1CCCNC(C)=O