Reaction Details
TargetMelatonin receptor type 1B
LigandBDBM50315170
Substrate/Competitorn/a
Meas. Tech.ChEMBL_624960 (CHEMBL1107083)
Ki 1.61±n/a nM
Citation Hu, YHo, MKChan, KHNew, DCWong, YH Synthesis of substituted N-[3-(3-methoxyphenyl)propyl] amides as highly potent MT(2)-selective melatonin ligands. Bioorg Med Chem Lett20:2582-5 (2010) 
 
Melatonin receptor type 1B
Name:Melatonin receptor type 1B
Type:Enzyme
Mol. Mass.:40203.54
Organism:Homo sapiens (Human)
Description:P49286
Residue:362
BDBM50315170
NameBDBM50315170
Synonyms:CHEMBL1091716 | N-(3-(5-methoxy-2-(pyridin-2-ylmethoxy)phenyl)propyl)acetamide
TypeSmall organic molecule
Emp. Form.C18H22N2O3
Mol. Mass.314.3789
SMILESCOc1ccc(OCc2ccccn2)c(CCCNC(C)=O)c1