Reaction Details
TargetMelatonin receptor type 1B
LigandBDBM50315171
Substrate/Competitorn/a
Meas. Tech.ChEMBL_624960 (CHEMBL1107083)
Ki 0.00069±n/a nM
Citation Hu, YHo, MKChan, KHNew, DCWong, YH Synthesis of substituted N-[3-(3-methoxyphenyl)propyl] amides as highly potent MT(2)-selective melatonin ligands. Bioorg Med Chem Lett20:2582-5 (2010) 
 
Melatonin receptor type 1B
Name:Melatonin receptor type 1B
Type:Enzyme
Mol. Mass.:40203.54
Organism:Homo sapiens (Human)
Description:P49286
Residue:362
BDBM50315171
NameBDBM50315171
Synonyms:CHEMBL1092646 | N-(3-(5-methoxy-2-(3-methoxybenzyloxy)phenyl)propyl)acetamide
TypeSmall organic molecule
Emp. Form.C20H25NO4
Mol. Mass.343.4168
SMILESCOc1cccc(COc2ccc(OC)cc2CCCNC(C)=O)c1