Reaction Details
TargetMelatonin receptor type 1B
LigandBDBM50315173
Substrate/Competitorn/a
Meas. Tech.ChEMBL_624960 (CHEMBL1107083)
Ki 121±n/a nM
Citation Hu, YHo, MKChan, KHNew, DCWong, YH Synthesis of substituted N-[3-(3-methoxyphenyl)propyl] amides as highly potent MT(2)-selective melatonin ligands. Bioorg Med Chem Lett20:2582-5 (2010) 
 
Melatonin receptor type 1B
Name:Melatonin receptor type 1B
Type:Enzyme
Mol. Mass.:40203.54
Organism:Homo sapiens (Human)
Description:P49286
Residue:362
BDBM50315173
NameBDBM50315173
Synonyms:CHEMBL1092911 | N-(3-(4-(benzyloxy)-3-methoxyphenyl)propyl)propionamide
TypeSmall organic molecule
Emp. Form.C20H25NO3
Mol. Mass.327.4174
SMILESCCC(=O)NCCCc1ccc(OCc2ccccc2)c(OC)c1