Reaction Details
TargetMelatonin receptor type 1A
LigandBDBM50315178
Substrate/Competitorn/a
Meas. Tech.ChEMBL_624959 (CHEMBL1107082)
Ki 1172±n/a nM
Citation Hu, YHo, MKChan, KHNew, DCWong, YH Synthesis of substituted N-[3-(3-methoxyphenyl)propyl] amides as highly potent MT(2)-selective melatonin ligands. Bioorg Med Chem Lett20:2582-5 (2010) 
 
Melatonin receptor type 1A
Name:Melatonin receptor type 1A
Type:Enzyme
Mol. Mass.:39392.94
Organism:Homo sapiens (Human)
Description:P48039
Residue:350
BDBM50315178
NameBDBM50315178
Synonyms:CHEMBL1088825 | N-(3-(2-(benzyloxy)-5-methoxyphenyl)propyl)butyramide
TypeSmall organic molecule
Emp. Form.C21H27NO3
Mol. Mass.341.444
SMILESCCCC(=O)NCCCc1cc(OC)ccc1OCc1ccccc1