Reaction Details
TargetSerine/threonine-protein kinase mTOR
LigandBDBM50315212
Substrate/Competitorn/a
Meas. Tech.ChEMBL_625172 (CHEMBL1117042)
IC50 2±n/a nM
Citation Zask, AVerheijen, JCRichard, DJKaplan, JCurran, KToral-Barza, LLucas, JHollander, IYu, K Discovery of 2-ureidophenyltriazines bearing bridged morpholines as potent and selective ATP-competitive mTOR inhibitors. Bioorg Med Chem Lett20:2644-7 (2010) 
 
Serine/threonine-protein kinase mTOR
Name:Serine/threonine-protein kinase mTOR
Type:PROTEIN
Mol. Mass.:288819.88
Organism:Rattus norvegicus
Description:ChEMBL_1460639
Residue:2549
BDBM50315212
NameBDBM50315212
Synonyms:1-(4-(4-(8-oxa-3-azabicyclo[3.2.1]octan-3-yl)-6-(3-oxa-8-azabicyclo[3.2.1]octan-8-yl)-1,3,5-triazin-2-yl)phenyl)-3-(4-(4-methylpiperazin-1-yl)phenyl)urea | CHEMBL1088974
TypeSmall organic molecule
Emp. Form.C33H41N9O3
Mol. Mass.611.7371
SMILESCN1CCN(CC1)c1ccc(NC(=O)Nc2ccc(cc2)-c2nc(nc(n2)N2CC3CCC(C2)O3)N2C3CCC2COC3)cc1