Reaction Details
TargetSerine/threonine-protein kinase mTOR
LigandBDBM50315213
Substrate/Competitorn/a
Meas. Tech.ChEMBL_625172 (CHEMBL1117042)
IC50 45±n/a nM
Citation Zask, AVerheijen, JCRichard, DJKaplan, JCurran, KToral-Barza, LLucas, JHollander, IYu, K Discovery of 2-ureidophenyltriazines bearing bridged morpholines as potent and selective ATP-competitive mTOR inhibitors. Bioorg Med Chem Lett20:2644-7 (2010) 
 
Serine/threonine-protein kinase mTOR
Name:Serine/threonine-protein kinase mTOR
Type:PROTEIN
Mol. Mass.:288819.88
Organism:Rattus norvegicus
Description:ChEMBL_1460639
Residue:2549
BDBM50315213
NameBDBM50315213
Synonyms:2-(difluoromethyl)-1-(4,6-dimorpholin-4-yl-1,3,5-triazin-2-yl)-1H-benzimidazole CHEMBL586702 | TCMDC-137004
TypeSmall organic molecule
Emp. Form.C19H21F2N7O2
Mol. Mass.417.4125
SMILESFC(F)c1nc2ccccc2n1-c1nc(nc(n1)N1CCOCC1)N1CCOCC1