Reaction Details
TargetSerine/threonine-protein kinase mTOR
LigandBDBM50315216
Substrate/Competitorn/a
Meas. Tech.ChEMBL_625172 (CHEMBL1117042)
IC50 2.5±n/a nM
Citation Zask, AVerheijen, JCRichard, DJKaplan, JCurran, KToral-Barza, LLucas, JHollander, IYu, K Discovery of 2-ureidophenyltriazines bearing bridged morpholines as potent and selective ATP-competitive mTOR inhibitors. Bioorg Med Chem Lett20:2644-7 (2010) 
 
Serine/threonine-protein kinase mTOR
Name:Serine/threonine-protein kinase mTOR
Type:PROTEIN
Mol. Mass.:288819.88
Organism:Rattus norvegicus
Description:ChEMBL_1460639
Residue:2549
BDBM50315216
NameBDBM50315216
Synonyms:1-(4-(4,6-di(8-oxa-3-azabicyclo[3.2.1]octan-3-yl)-1,3,5-triazin-2-yl)phenyl)-3-methylurea | CHEMBL1092642
TypeSmall organic molecule
Emp. Form.C23H29N7O3
Mol. Mass.451.5215
SMILESCNC(=O)Nc1ccc(cc1)-c1nc(nc(n1)N1CC2CCC(C1)O2)N1CC2CCC(C1)O2