Reaction Details
TargetCalcitonin gene-related peptide type 1 receptor
LigandBDBM50315401
Substrate/Competitorn/a
Meas. Tech.ChEMBL_626018 (CHEMBL1106146)
IC50 0.077±n/a nM
Citation Stump, CABell, IMBednar, RAFay, JFGallicchio, SNHershey, JCJelley, RKreatsoulas, CMoore, ELMosser, SDQuigley, AGRoller, SASalvatore, CASharik, SSTheberge, CRZartman, CBKane, SAGraham, SLSelnick, HGVacca, JPWilliams, TM Identification of potent, highly constrained CGRP receptor antagonists. Bioorg Med Chem Lett20:2572-6 (2010) 
 
Calcitonin gene-related peptide type 1 receptor
Name:Calcitonin gene-related peptide type 1 receptor
Type:Enzyme Catalytic Domain
Mol. Mass.:52980.45
Organism:Homo sapiens (Human)
Description:Q16602
Residue:461
BDBM50315401
NameBDBM50315401
Synonyms:(R)-1-((2'-oxo-1',2',6,8-tetrahydrospiro[cyclopenta[g]quinoline-7,3'-pyrrolo[2,3-b]pyridine]-2-yl)methyl)-1H-imidazo[1,5,4-de]quinoxaline-2,5(4H,6H)-dione | CHEMBL1092882
TypeSmall organic molecule
Emp. Form.C28H20N6O3
Mol. Mass.488.4968
SMILESO=C1Nc2ncccc2[C@]11Cc2cc3ccc(Cn4c5cccc6NC(=O)Cn(c56)c4=O)nc3cc2C1