Reaction Details
TargetCalcitonin gene-related peptide type 1 receptor
LigandBDBM50315404
Substrate/Competitorn/a
Meas. Tech.ChEMBL_626017 (CHEMBL1106145)
Ki 1.5±n/a nM
Citation Stump, CABell, IMBednar, RAFay, JFGallicchio, SNHershey, JCJelley, RKreatsoulas, CMoore, ELMosser, SDQuigley, AGRoller, SASalvatore, CASharik, SSTheberge, CRZartman, CBKane, SAGraham, SLSelnick, HGVacca, JPWilliams, TM Identification of potent, highly constrained CGRP receptor antagonists. Bioorg Med Chem Lett20:2572-6 (2010) 
 
Calcitonin gene-related peptide type 1 receptor
Name:Calcitonin gene-related peptide type 1 receptor
Type:Enzyme Catalytic Domain
Mol. Mass.:52980.45
Organism:Homo sapiens (Human)
Description:Q16602
Residue:461
BDBM50315404
NameBDBM50315404
Synonyms:(4'S)-3'-methyl-2-((4-oxo-2a,3,4,5-tetrahydropyrrolo[4,3,2-de]quinolin-1(2H)-yl)methyl)-6,8-dihydrospiro[cyclopenta[g]quinoline-7,4'-imidazolidine]-2',5'-dione | CHEMBL1090841
TypeSmall organic molecule
Emp. Form.C26H23N5O3
Mol. Mass.453.4925
SMILESCN1C(=O)NC(=O)[C@@]11Cc2cc3ccc(CN4CC5CC(=O)Nc6cccc4c56)nc3cc2C1