Reaction Details
TargetCarbonic anhydrase
LigandBDBM50258587
Substrate/Competitorn/a
Meas. Tech.ChEMBL_626038 (CHEMBL1106166)
Ki 42±n/a nM
Citation Güzel, OMaresca, AHall, RAScozzafava, AMastrolorenzo, AMühlschlegel, FASupuran, CT Carbonic anhydrase inhibitors. The beta-carbonic anhydrases from the fungal pathogens Cryptococcus neoformans and Candida albicans are strongly inhibited by substituted-phenyl-1H-indole-5-sulfonamides. Bioorg Med Chem Lett20:2508-11 (2010) 
 
Carbonic anhydrase
Name:Carbonic anhydrase
Type:Enzyme
Mol. Mass.:31587.59
Organism:Candida albicans (Yeast)
Description:n/a
Residue:281
BDBM50258587
NameBDBM50258587
Synonyms:1-(([5-(Aminosulfonyl)-3-phenyl-1H-indol-2-yl]carbonyl)amino)-2,4,6-trimethylpyridinium Perchlorate CHEMBL466832
TypeSmall organic molecule
Emp. Form.C23H23N4O3S
Mol. Mass.435.518
SMILESCc1cc(C)[n+](NC(=O)c2[nH]c3ccc(cc3c2-c2ccccc2)S(N)(=O)=O)c(C)c1