Reaction Details
TargetCarbonic anhydrase
LigandBDBM50258634
Substrate/Competitorn/a
Meas. Tech.ChEMBL_626038 (CHEMBL1106166)
Ki 24±n/a nM
Citation Güzel, OMaresca, AHall, RAScozzafava, AMastrolorenzo, AMühlschlegel, FASupuran, CT Carbonic anhydrase inhibitors. The beta-carbonic anhydrases from the fungal pathogens Cryptococcus neoformans and Candida albicans are strongly inhibited by substituted-phenyl-1H-indole-5-sulfonamides. Bioorg Med Chem Lett20:2508-11 (2010) 
 
Carbonic anhydrase
Name:Carbonic anhydrase
Type:Enzyme
Mol. Mass.:31587.59
Organism:Candida albicans (Yeast)
Description:n/a
Residue:281
BDBM50258634
NameBDBM50258634
Synonyms:1-(3-(3-fluorophenyl)-5-sulfamoyl-1H-indole-2-carboxamido)-2,4,6-trimethylpyridinium perchlorate CHEMBL468094
TypeSmall organic molecule
Emp. Form.C23H22FN4O3S
Mol. Mass.453.509
SMILESCc1cc(C)[n+](NC(=O)c2[nH]c3ccc(cc3c2-c2cccc(F)c2)S(N)(=O)=O)c(C)c1