Reaction Details
TargetCarbonic anhydrase
LigandBDBM50258716
Substrate/Competitorn/a
Meas. Tech.ChEMBL_626038 (CHEMBL1106166)
Ki 41±n/a nM
Citation Güzel, OMaresca, AHall, RAScozzafava, AMastrolorenzo, AMühlschlegel, FASupuran, CT Carbonic anhydrase inhibitors. The beta-carbonic anhydrases from the fungal pathogens Cryptococcus neoformans and Candida albicans are strongly inhibited by substituted-phenyl-1H-indole-5-sulfonamides. Bioorg Med Chem Lett20:2508-11 (2010) 
 
Carbonic anhydrase
Name:Carbonic anhydrase
Type:Enzyme
Mol. Mass.:31587.59
Organism:Candida albicans (Yeast)
Description:n/a
Residue:281
BDBM50258716
NameBDBM50258716
Synonyms:1-({[5-(Aminosulfonyl)-3-(4-bromophenyl)-1H-indol-2-yl]carbonyl}amino)-2,4,6 trimethylpyridinium perchlorate CHEMBL468946
TypeSmall organic molecule
Emp. Form.C24H25N4O3S
Mol. Mass.449.545
SMILESCc1ccc(cc1)-c1c([nH]c2ccc(cc12)S(N)(=O)=O)C(=O)N[n+]1c(C)cc(C)cc1C