Reaction Details
TargetCarbonic anhydrase
LigandBDBM50258299
Substrate/Competitorn/a
Meas. Tech.ChEMBL_626038 (CHEMBL1106166)
Ki 5.1±n/a nM
Citation Güzel, OMaresca, AHall, RAScozzafava, AMastrolorenzo, AMühlschlegel, FASupuran, CT Carbonic anhydrase inhibitors. The beta-carbonic anhydrases from the fungal pathogens Cryptococcus neoformans and Candida albicans are strongly inhibited by substituted-phenyl-1H-indole-5-sulfonamides. Bioorg Med Chem Lett20:2508-11 (2010) 
 
Carbonic anhydrase
Name:Carbonic anhydrase
Type:Enzyme
Mol. Mass.:31587.59
Organism:Candida albicans (Yeast)
Description:n/a
Residue:281
BDBM50258299
NameBDBM50258299
Synonyms:1-({[5-(Aminosulfonyl)-3-(2,3,4,5,6-pentafluorophenyl)-1H-indol-2-yl]carbonyl}amino)-2,4,6 trimethylpyridinium perchlorate CHEMBL501294
TypeSmall organic molecule
Emp. Form.C23H18F5N4O3S
Mol. Mass.525.47
SMILESCc1cc(C)[n+](NC(=O)c2[nH]c3ccc(cc3c2-c2c(F)c(F)c(F)c(F)c2F)S(N)(=O)=O)c(C)c1