Reaction Details
TargetProstacyclin receptor
LigandBDBM50315467
Substrate/Competitorn/a
Meas. Tech.ChEMBL_626798 (CHEMBL1107245)
IC50>20000±n/a nM
Citation Zhou, NPolozov, AMO'Connell, MBurgeson, JYu, PZeller, WZhang, JOnua, ERamirez, JPalsdottir, GAHalldorsdottir, GVAndresson, TKiselyov, ASGurney, MSingh, J 1,7-Disubstituted oxyindoles are potent and selective EP(3) receptor antagonists. Bioorg Med Chem Lett20:2658-64 (2010) 
 
Prostacyclin receptor
Name:Prostacyclin receptor
Type:G Protein-Coupled Receptor (GPCR)
Mol. Mass.:40968.22
Organism:Homo sapiens (Human)
Description:The membranes prepared from human platelet were used in binding assay.
Residue:386
BDBM50315467
NameBDBM50315467
Synonyms:CHEMBL1093791 | N-(4-fluorophenylsulfonyl)-3-(3-hydroxy-1-(naphthalen-2-ylmethyl)-2-oxoindolin-7-yl)acrylamide
TypeSmall organic molecule
Emp. Form.C28H21FN2O5S
Mol. Mass.516.54
SMILESOC1C(=O)N(Cc2ccc3ccccc3c2)c2c1cccc2\C=C\C(=O)NS(=O)(=O)c1ccc(F)cc1