Reaction Details
TargetProstaglandin E2 receptor EP3 subtype
LigandBDBM50315487
Substrate/Competitorn/a
Meas. Tech.ChEMBL_626787 (CHEMBL1107234)
IC50 1.3±n/a nM
Citation Zhou, NPolozov, AMO'Connell, MBurgeson, JYu, PZeller, WZhang, JOnua, ERamirez, JPalsdottir, GAHalldorsdottir, GVAndresson, TKiselyov, ASGurney, MSingh, J 1,7-Disubstituted oxyindoles are potent and selective EP(3) receptor antagonists. Bioorg Med Chem Lett20:2658-64 (2010) 
 
Prostaglandin E2 receptor EP3 subtype
Name:Prostaglandin E2 receptor EP3 subtype
Type:Enzyme
Mol. Mass.:43335.03
Organism:Homo sapiens (Human)
Description:P43115
Residue:390
BDBM50315487
NameBDBM50315487
Synonyms:3-(1-(3,4-difluorobenzyl)-3,3-difluoro-2-oxoindolin-7-yl)-N-(3,4-difluorophenylsulfonyl)acrylamide | CHEMBL1091621
TypeSmall organic molecule
Emp. Form.C24H14F6N2O4S
Mol. Mass.540.434
SMILESFc1ccc(CN2C(=O)C(F)(F)c3cccc(\C=C\C(=O)NS(=O)(=O)c4ccc(F)c(F)c4)c23)cc1F