Reaction Details
TargetProstaglandin E2 receptor EP3 subtype
LigandBDBM50315519
Substrate/Competitorn/a
Meas. Tech.ChEMBL_626787 (CHEMBL1107234)
IC50 2.4±n/a nM
Citation Zhou, NPolozov, AMO'Connell, MBurgeson, JYu, PZeller, WZhang, JOnua, ERamirez, JPalsdottir, GAHalldorsdottir, GVAndresson, TKiselyov, ASGurney, MSingh, J 1,7-Disubstituted oxyindoles are potent and selective EP(3) receptor antagonists. Bioorg Med Chem Lett20:2658-64 (2010) 
 
Prostaglandin E2 receptor EP3 subtype
Name:Prostaglandin E2 receptor EP3 subtype
Type:Enzyme
Mol. Mass.:43335.03
Organism:Homo sapiens (Human)
Description:P43115
Residue:390
BDBM50315519
NameBDBM50315519
Synonyms:3-(1-(2,4-dichlorobenzyl)-3-methyl-2-oxoindolin-7-yl)-N-(thiophen-2-ylsulfonyl)acrylamide | CHEMBL1089806
TypeSmall organic molecule
Emp. Form.C23H18Cl2N2O4S2
Mol. Mass.521.436
SMILESCC1C(=O)N(Cc2ccc(Cl)cc2Cl)c2c1cccc2\C=C\C(=O)NS(=O)(=O)c1cccs1