Reaction Details
TargetProstaglandin E2 receptor EP3 subtype
LigandBDBM50315473
Substrate/Competitorn/a
Meas. Tech.ChEMBL_626788 (CHEMBL1107235)
IC50 5.5±n/a nM
Citation Zhou, NPolozov, AMO'Connell, MBurgeson, JYu, PZeller, WZhang, JOnua, ERamirez, JPalsdottir, GAHalldorsdottir, GVAndresson, TKiselyov, ASGurney, MSingh, J 1,7-Disubstituted oxyindoles are potent and selective EP(3) receptor antagonists. Bioorg Med Chem Lett20:2658-64 (2010) 
 
Prostaglandin E2 receptor EP3 subtype
Name:Prostaglandin E2 receptor EP3 subtype
Type:Enzyme
Mol. Mass.:43335.03
Organism:Homo sapiens (Human)
Description:P43115
Residue:390
BDBM50315473
NameBDBM50315473
Synonyms:3-(1-(2,4-dichlorobenzyl)-3,3-difluoro-2-oxoindolin-7-yl)-N-(3,4-dichlorophenylsulfonyl)acrylamide | CHEMBL1089094
TypeSmall organic molecule
Emp. Form.C24H14Cl4F2N2O4S
Mol. Mass.606.253
SMILESFC1(F)C(=O)N(Cc2ccc(Cl)cc2Cl)c2c1cccc2\C=C\C(=O)NS(=O)(=O)c1ccc(Cl)c(Cl)c1