Reaction Details
TargetProstaglandin E2 receptor EP3 subtype
LigandBDBM50315506
Substrate/Competitorn/a
Meas. Tech.ChEMBL_626788 (CHEMBL1107235)
IC50 55.4±n/a nM
Citation Zhou, NPolozov, AMO'Connell, MBurgeson, JYu, PZeller, WZhang, JOnua, ERamirez, JPalsdottir, GAHalldorsdottir, GVAndresson, TKiselyov, ASGurney, MSingh, J 1,7-Disubstituted oxyindoles are potent and selective EP(3) receptor antagonists. Bioorg Med Chem Lett20:2658-64 (2010) 
 
Prostaglandin E2 receptor EP3 subtype
Name:Prostaglandin E2 receptor EP3 subtype
Type:Enzyme
Mol. Mass.:43335.03
Organism:Homo sapiens (Human)
Description:P43115
Residue:390
BDBM50315506
NameBDBM50315506
Synonyms:CHEMBL1091146 | N-(4,5-dichlorothiophen-2-ylsulfonyl)-3-(1-(3,4-difluorobenzyl)-2-oxoindolin-7-yl)acrylamide
TypeSmall organic molecule
Emp. Form.C22H14Cl2F2N2O4S2
Mol. Mass.543.39
SMILESFc1ccc(CN2C(=O)Cc3cccc(\C=C\C(=O)NS(=O)(=O)c4cc(Cl)c(Cl)s4)c23)cc1F