Reaction Details
TargetAurora kinase B
LigandBDBM50315847
Substrate/Competitorn/a
Meas. Tech.ChEMBL_624741 (CHEMBL1113417)
IC50 110±n/a nM
Citation Blanchard, SWilliam, ADLee, ACPoulsen, ATeo, ELDeng, WTu, NTan, EGoh, KLOng, WCNg, CPGoh, KCBonday, ZSun, ET Synthesis and evaluation of alkenyl indazoles as selective Aurora kinase inhibitors. Bioorg Med Chem Lett20:2443-7 (2010) 
 
Aurora kinase B
Name:Aurora kinase B
Type:Protein
Mol. Mass.:39327.72
Organism:Homo sapiens (Human)
Description:Q96GD4
Residue:344
BDBM50315847
NameBDBM50315847
Synonyms:CHEMBL1093877 | N-(6-methyl-3-(phenylethynyl)-1H-indazol-5-yl)-2-(thiophen-2-yl)acetamide
TypeSmall organic molecule
Emp. Form.C22H17N3OS
Mol. Mass.371.455
SMILESCc1cc2[nH]nc(C#Cc3ccccc3)c2cc1NC(=O)Cc1cccs1