Reaction Details
TargetAurora kinase B
LigandBDBM50315845
Substrate/Competitorn/a
Meas. Tech.ChEMBL_624741 (CHEMBL1113417)
IC50 810±n/a nM
Citation Blanchard, SWilliam, ADLee, ACPoulsen, ATeo, ELDeng, WTu, NTan, EGoh, KLOng, WCNg, CPGoh, KCBonday, ZSun, ET Synthesis and evaluation of alkenyl indazoles as selective Aurora kinase inhibitors. Bioorg Med Chem Lett20:2443-7 (2010) 
 
Aurora kinase B
Name:Aurora kinase B
Type:Protein
Mol. Mass.:39327.72
Organism:Homo sapiens (Human)
Description:Q96GD4
Residue:344
BDBM50315845
NameBDBM50315845
Synonyms:6-(4-methylpiperazin-1-yl)-N-(pyridin-2-ylmethyl)-3-styryl-1H-indazol-5-amine | CHEMBL1093878
TypeSmall organic molecule
Emp. Form.C26H28N6
Mol. Mass.424.5407
SMILESCN1CCN(CC1)c1cc2[nH]nc(\C=C\c3ccccc3)c2cc1NCc1ccccn1