Reaction Details
TargetAurora kinase B
LigandBDBM50315836
Substrate/Competitorn/a
Meas. Tech.ChEMBL_624741 (CHEMBL1113417)
IC50 99±n/a nM
Citation Blanchard, SWilliam, ADLee, ACPoulsen, ATeo, ELDeng, WTu, NTan, EGoh, KLOng, WCNg, CPGoh, KCBonday, ZSun, ET Synthesis and evaluation of alkenyl indazoles as selective Aurora kinase inhibitors. Bioorg Med Chem Lett20:2443-7 (2010) 
 
Aurora kinase B
Name:Aurora kinase B
Type:Protein
Mol. Mass.:39327.72
Organism:Homo sapiens (Human)
Description:Q96GD4
Residue:344
BDBM50315836
NameBDBM50315836
Synonyms:CHEMBL1091233 | N-(4-methyl-3-(3-((4-methylpiperazin-1-yl)methyl)styryl)-1H-indazol-5-yl)-2-(thiophen-2-yl)acetamide
TypeSmall organic molecule
Emp. Form.C28H31N5OS
Mol. Mass.485.644
SMILESCN1CCN(Cc2cccc(\C=C\c3n[nH]c4ccc(NC(=O)Cc5cccs5)c(C)c34)c2)CC1