Reaction Details
TargetAurora kinase A
LigandBDBM50315832
Substrate/Competitorn/a
Meas. Tech.ChEMBL_624739 (CHEMBL1113415)
IC50 350±n/a nM
Citation Blanchard, SWilliam, ADLee, ACPoulsen, ATeo, ELDeng, WTu, NTan, EGoh, KLOng, WCNg, CPGoh, KCBonday, ZSun, ET Synthesis and evaluation of alkenyl indazoles as selective Aurora kinase inhibitors. Bioorg Med Chem Lett20:2443-7 (2010) 
 
Aurora kinase A
Name:Aurora kinase A
Type:Serine/threonine-protein kinase
Mol. Mass.:45830.98
Organism:Homo sapiens (Human)
Description:O14965
Residue:403
BDBM50315832
NameBDBM50315832
Synonyms:3-methyl-5-(4-methyl-3-(3-((4-methylpiperazin-1-yl)methyl)styryl)-1H-indazol-5-yl)aniline | CHEMBL1093821
TypeSmall organic molecule
Emp. Form.C29H33N5
Mol. Mass.451.6058
SMILESCN1CCN(Cc2cccc(\C=C\c3n[nH]c4ccc(-c5cc(C)cc(N)c5)c(C)c34)c2)CC1