Reaction Details
TargetAurora kinase A
LigandBDBM50315833
Substrate/Competitorn/a
Meas. Tech.ChEMBL_624739 (CHEMBL1113415)
IC50 280±n/a nM
Citation Blanchard, SWilliam, ADLee, ACPoulsen, ATeo, ELDeng, WTu, NTan, EGoh, KLOng, WCNg, CPGoh, KCBonday, ZSun, ET Synthesis and evaluation of alkenyl indazoles as selective Aurora kinase inhibitors. Bioorg Med Chem Lett20:2443-7 (2010) 
 
Aurora kinase A
Name:Aurora kinase A
Type:Serine/threonine-protein kinase
Mol. Mass.:45830.98
Organism:Homo sapiens (Human)
Description:O14965
Residue:403
BDBM50315833
NameBDBM50315833
Synonyms:4-methyl-3-(3-((4-methylpiperazin-1-yl)methyl)styryl)-1H-indazole-5-carbonitrile | CHEMBL1093515
TypeSmall organic molecule
Emp. Form.C23H25N5
Mol. Mass.371.4781
SMILESCN1CCN(Cc2cccc(\C=C\c3n[nH]c4ccc(C#N)c(C)c34)c2)CC1