Reaction Details
TargetAurora kinase A
LigandBDBM50315834
Substrate/Competitorn/a
Meas. Tech.ChEMBL_624739 (CHEMBL1113415)
IC50 35±n/a nM
Citation Blanchard, SWilliam, ADLee, ACPoulsen, ATeo, ELDeng, WTu, NTan, EGoh, KLOng, WCNg, CPGoh, KCBonday, ZSun, ET Synthesis and evaluation of alkenyl indazoles as selective Aurora kinase inhibitors. Bioorg Med Chem Lett20:2443-7 (2010) 
 
Aurora kinase A
Name:Aurora kinase A
Type:Serine/threonine-protein kinase
Mol. Mass.:45830.98
Organism:Homo sapiens (Human)
Description:O14965
Residue:403
BDBM50315834
NameBDBM50315834
Synonyms:1-phenyl-N-(3-styryl-1H-indazol-5-yl)methanesulfonamide | CHEMBL1093514
TypeSmall organic molecule
Emp. Form.C22H19N3O2S
Mol. Mass.389.47
SMILESO=S(=O)(Cc1ccccc1)Nc1ccc2[nH]nc(\C=C\c3ccccc3)c2c1