Reaction Details
TargetAurora kinase A
LigandBDBM50315838
Substrate/Competitorn/a
Meas. Tech.ChEMBL_624739 (CHEMBL1113415)
IC50 79±n/a nM
Citation Blanchard, SWilliam, ADLee, ACPoulsen, ATeo, ELDeng, WTu, NTan, EGoh, KLOng, WCNg, CPGoh, KCBonday, ZSun, ET Synthesis and evaluation of alkenyl indazoles as selective Aurora kinase inhibitors. Bioorg Med Chem Lett20:2443-7 (2010) 
 
Aurora kinase A
Name:Aurora kinase A
Type:Serine/threonine-protein kinase
Mol. Mass.:45830.98
Organism:Homo sapiens (Human)
Description:O14965
Residue:403
BDBM50315838
NameBDBM50315838
Synonyms:CHEMBL1091231 | N-(6-methyl-3-(3-((4-methylpiperazin-1-yl)methyl)styryl)-1H-indazol-5-yl)-2-(thiophen-2-yl)acetamide
TypeSmall organic molecule
Emp. Form.C28H31N5OS
Mol. Mass.485.644
SMILESCN1CCN(Cc2cccc(\C=C\c3n[nH]c4cc(C)c(NC(=O)Cc5cccs5)cc34)c2)CC1